{"text_format":"3","workbook":"xlsx","n_sheets":10,"sheets":["Texte","Corrections","Linear","B1","B2","B3","B4","B5","B6","Reserve"],"not_rendered":{"images":1,"defined_names":28},"read":"whole","date_system":"1900"}

{"sheet":"Texte","index":0,"n_rows":96,"n_cols":13,"rows_kept":96,"hidden":true}
["Texte","Français","Deutsch",{"$nulls":4},"Sprache","Finished","VersionsNummer","ProgrammName","VersionsDatum","BlattRef"]
[{"$nulls":7},2,1,2.5,"Linear","2018-05-29",{"$f":"A1","v":"Texte"}]
[{"$f":"IF(H$2=1,B3,IF(H$2=2,C3,IF(H$2=3,D3,\"\")))","v":"Mischfutterzufuhr"},"Entrée aliments","Mischfutterzufuhr",{"$nulls":4},{"$f":"IF(H$2=1,I3,IF(H$2=2,J3,IF(H$2=3,K3,\"\")))","v":"Français"},"Français","Français","Français",null,{"$f":"Linear!L1","v":"Resultate"}]
[{"$f":"IF(H$2=1,B4,IF(H$2=2,C4,IF(H$2=3,D4,\"\")))","v":"Futterzufuhr"},"Entrée aliments","Futterzufuhr",{"$nulls":4},{"$f":"IF(H$2=1,I4,IF(H$2=2,J4,IF(H$2=3,K4,\"\")))","v":"Deutsch"},"Deutsch","Deutsch","Deutsch",null,{"$f":"'B1'!I1","v":"B1: Mischfutterzufuhr"}]
[{"$f":"IF(H$2=1,B5,IF(H$2=2,C5,IF(H$2=3,D5,\"\")))","v":"Seite"},"page","Seite",{"$nulls":4},{"$f":"IF(H$2=1,I5,IF(H$2=2,J5,IF(H$2=3,K5,\"\")))","v":0},{"$nulls":4},{"$f":"'B2'!I1","v":"B2: Mischfutterzufuhr"}]
[{"$f":"IF(H$2=1,B6,IF(H$2=2,C6,IF(H$2=3,D5,\"\")))","v":"Tiere"},"Animaux","Tiere",{"$nulls":9},{"$f":"'B3'!I1","v":"B3: Mischfutterzufuhr"}]
["pro kg Futter","par kg d'aliment","pro kg Futter",{"$nulls":9},{"$f":"'B4'!I1","v":"B4: Futterzufuhr"}]
["Datum","Date","Datum",{"$nulls":9},{"$f":"'B5'!I1","v":"B5: Futterzufuhr"}]
["kg Futter","kg aliment","kg Futter",{"$nulls":9},{"$f":"'B6'!I1","v":"B6: Futterzufuhr"}]
["Total Zufuhr","Total entrée","Total Zufuhr",{"$nulls":9},{"$f":"Reserve!StartZelle","v":"Reserve"}]
["Kantonale Kontrollstelle      Datum:","Organisation de contrôle      Date:","Kantonale Kontrollstelle      Datum:"]
["Unterschrift:","Signature:","Unterschrift:"]
["Es müssen alle eingesetzten Futtermittel erfasst werden.","Tous les aliments utilisés doivent être saisis.","Es müssen alle eingesetzten Futtermittel erfasst werden."]
["In kg FS","En kg MF","In kg FS"]
["In kg TS","En kg MS","In kg TS"]
["kg FS","kg MF","kg FS"]
["pro kg TS","par kg MS","pro kg TS"]
["Monat","Mois","Monat"]
["kg TS","kg MS","kg TS"]
["Mastschweine","Porcs à l'engrais","Mastschweine"]
["Zuchtschw./ Eber","Truies d'él./ verrat","Zuchtschw./ Eber"]
["Ferkel","Porcelets","Ferkel"]
["Legehennen","Poules pondeuses","Legehennen"]
["In kg TS erfassen","Saisie en kg MS","In kg TS erfassen"]
["TS in %","MS en %","TS in %"]
["MJ UEG","MJ EMV","MJ UEG"]
["MJ VES/UEG","MJ EDP/EMV","MJ VES/UEG"]
["g RP","g MA","g RP"]
["g P","g P","g P"]
["Kantonale Kontrollstelle, Datum:","Organisation de contrôle, Date:","Kantonale Kontrollstelle, Datum:"]
["Unterschrift:","Signature:","Unterschrift:"]
["Betriebsleiter, Datum:","Exploitant, Date:","Betriebsleiter, Datum:"]
["Futter in % Aufteilen","Répartition en %","Futter in % Aufteilen"]
["Mais ganze Pflanze","Maïs plante entière","Mais ganze Pflanze"]
["Wiesenfutter","Herbages","Wiesenfutter"]
["(Gras, Silo, ...)","(herbe, silo, ...)","(Gras, Silo, ...)"]
[{"$f":"IF(H$2=1,B37,IF(H$2=2,C37,IF(H$2=3,D35,\"\")))","v":"Schotte"},"Lactosérum","Schotte"]
["CCM","CCM","CCM"]
[{"$f":"IF(H$2=1,B39,IF(H$2=2,C39,IF(H$2=3,D38,\"\")))","v":"Stroh, Strohpellets"},"Paille, granulés de paille","Stroh, Strohpellets"]
["Beschäftigungs-, Raufutterwürfel","Matériaux d'occupation, dés de fourrage grossier","Beschäftigungs-, Raufutterwürfel"]
["Aufteilung in %","Répartition en %","Aufteilung in %"]
["Zusammenfassung der Futterzufuhr auf dem Betrieb","Résumé des entrées d'aliments sur l'exploitation","Zusammenfassung der Futterzufuhr auf dem Betrieb"]
["kg Futter pro Tierkategorie","kg d'aliment par catégorie d'animaux","kg Futter pro Tierkategorie"]
["Zusammenfassung der Gehalte nach Tierkategorie","Résumé des teneurs par catégorie d'animaux","Zusammenfassung der Gehalte nach Tierkategorie"]
["Verfütterte Trockensubstanz","Matière sèche affouragée","Verfütterte Trockensubstanz"]
["Menge Futter in 88% TS","Quantité d'aliment à 88 % MS","Menge Futter in 88% TS"]
["Total Energie","Energie total","Total Energie"]
["Total Protein","Protéines totales","Total Protein"]
["Total Phosphor","Phosphore total","Total Phosphor"]
["kg TS","kg MS","kg TS"]
["Durchschnittsgehalt pro kg Futter 88%","Teneurs moyennes par kg d'aliment à 88%","Durchschnittsgehalt pro kg Futter 88%"]
["Durchschnittsgehalt Energie","Teneur moyenne en énergie","Durchschnittsgehalt Energie"]
["Durchschnittsgehalt Protein ","Teneur moyenne en protéines","Durchschnittsgehalt Protein "]
["Durchschnittsgehalt Phosphor","Teneur moyenne en phosphore","Durchschnittsgehalt Phosphor"]
["Durchschnittsgehalt pro MJ","Teneurs moyennes par MJ","Durchschnittsgehalt pro MJ"]
["Durchschnittsgehalt Schweine","Teneurs moyennes des porcs","Durchschnittsgehalt Schweine"]
["Der Betriebsleiter bestätigt die Vollständigkeit der Angaben auf diesem Blatt, wie auch auf den Aufzeichnungen zu den Futterzufuhren.","L'exploitant certifie l'exactitude des informations saisies sur cette feuille ainsi que les indications sur les achats d'aliments.","Der Betriebsleiter bestätigt die Vollständigkeit der Angaben auf diesem Blatt, wie auch auf den Aufzeichnungen zu den Futterzufuhren."]
["MJ VES o. UEG","MJ EDP ou EMV","MJ VES o. UEG"]
["g RP / MJ VES",{"$f":"B28&\" / MJ EDP\"","v":"g MA / MJ EDP"},{"$f":"C28&\" / MJ VES\"","v":"g RP / MJ VES"}]
["Maximale Stallplätze und durchschnittliche Anzahl","Nombre maximum de places et nombre moyen","Maximale Stallplätze und durchschnittliche Anzahl"]
["Tiere auf dem Betrieb in dieser Periode","d'animaux sur l'exploitation durant cette période","Tiere auf dem Betrieb in dieser Periode"]
["Maximale Anz.","Nb maximum","Maximale Anz."]
["Stallplätze","de places","Stallplätze"]
["Durchschn.","Nb moyen de","Durchschn."]
["besetzte Pl.","pl. occupées","besetzte Pl."]
["Mastschweine und Remonten < 6 Mte","Porcs à l'engrais et remontes < 6 mois","Mastschweine und Remonten < 6 Mte"]
["Abgesetzte Ferkel bis 26 kg LG","Porcelets sevrés < 26 kg","Abgesetzte Ferkel bis 26 kg LG"]
["Zuchteber","Verrats d'élevage","Zuchteber"]
["Nicht säugende Zuchtsauen > 6 Mte","Truies non allaitantes > 6 mois","Nicht säugende Zuchtsauen > 6 Mte"]
["Säugende Zuchtsauen","Truies allaitantes","Säugende Zuchtsauen"]
[{"$f":"IF(H$2=1,B71,IF(H$2=2,C71,IF(H$2=3,D70,\"\")))","v":"Legehennen"},"Poules pondeuses","Legehennen"]
["Bruteierproduzierende Hennen, Hähne","Poules et coqs, product d'oefs à couver","Bruteierproduzierende Hennen, Hähne"]
["Tiere","Animaux","Tiere"]
["pro Jahr","par an","pro Jahr"]
[{"$f":"IF(H$2=1,B75,IF(H$2=2,C75,IF(H$2=3,D73,\"\")))","v":"Aufteilen"},"Répartition","Aufteilen"]
["Anfang","Début","Anfang"]
["Ende","Fin","Ende"]
["Plätze","Places","Plätze"]
["Dauer:","Durée:","Dauer:"]
["Tage","Jours","Tage"]
["Suisse-Bilanz: Lineare Korrektur","Suisse-Bilanz: Correction linéaire","Suisse-Bilanz: Lineare Korrektur"]
["Resultate","Résultat","Resultate"]
["Betriebs-Nr:","No cantonal:","Betriebs-Nr:"]
["Name:","Nom:","Name:"]
["Vorname:","Prénom:","Vorname:"]
["Adresse:","Adresse:","Adresse:"]
["Adresszusatz:","Complément:","Adresszusatz:"]
["PLZ, Ort:","NPA, lieu:","PLZ, Ort:"]
["Berechnet durch:","Calculé par:","Berechnet durch:"]
["Telefon-Nr.:","No téléphone:","Telefon-Nr.:"]
["Fax / E-Mail:","Fax / e-mail:","Fax / E-Mail:"]
["Firma:","Firme:","Firma:"]
["Datum Anfang:","Date début:","Datum Anfang:"]
["Datum Ende:","Date fin:","Datum Ende:"]
["Betriebsleiter, Datum:","Exploitant, Date:","Betriebsleiter, Datum:"]
["Unterschrift Betriebsleiter:","Signature de l'exploitant:","Unterschrift Betriebsleiter:"]

{"sheet":"Corrections","index":1,"n_rows":13,"n_cols":7,"rows_kept":13,"hidden":true}
["Datum","Blatt","Anpassungen","Grund","Wer?",null,"TextBlattRef"]
["2004-05-25","Linear","Bei allen Tierarten können die Tier mit einer Kommastelle angegeben werden (analog Impex)","GT 19.5.2004",null,null,{"$f":"Texte!A1","v":"Texte"}]
["2004-05-27","Texte","Text auf französisch \"truies non allaitantes\" statt \"truies gestantes\". Wirkt sich auf Blatt Linear aus.","AZI"]
["2004-06-02","B5","Anpassungen der Werte des gelben Buchs: \nSchotte  137 RP, 7.3 P; \nMaïs ganze Pflanze 100 %TS, 11 MJ, 74 RP, 2 P.","Anpassungen ALP"]
["2004-07-12","Linear","Berechnungen G16 bis J35 waren falsch, Korrektur bei Anfang und Endinventar","Fehlermeldung T. Schildknecht"]
["2008-04-03","B5","Angepasste Gehaltswerte für Schotte, CCM, Mais ganze Pflanze u. Wiesenfutter  aufgrund Futtermitteldatenbank ALP","GT 12.03.08"]
["2009-01-07","B5","Angepasste Gehaltswerte für Schotte, CCM, Mais ganze Pflanze u. Wiesenfutter  aufgrund Futtermitteldatenbank ALP","GT Dez.08"]
["2010-06-15","B5","Angepasste Gehaltswerte für Wiesenfutter  aufgrund Futtermitteldatenbank ALP","GT Nov.09"]
["2015-09-17","Linear","Erhebung maximale Stallplätze, Bruteierprod. Hennen ergänzt, Anpassungen Layout",null,"DFE"]
["2015-10-20","Linear","Erhebung maximale Stallplätze für bruteierprod.- und Legehennen entfernt ","M. Ofner, Th. Schildknecht","DFE"]
["2017-09-07","Linear","Einfügen von Stroh, Strohpellets und Beschäftigungs- + Raufutterwürfel, Durchschnittsgehalt für Schweine","GT Mrz., Nov. 2016","IWE / DFE"]
["2017-09-07","B6","Neues Blatt einfügen für Stroh, Strohpellets und Beschäftigungs- + Raufutterwürfel","GT Mrz., Nov. 2016","IWE / DFE"]
["2018-05-29","Linear","Abgesetzte Ferkel -> 26 kg, Durchschnittsgehalt Schweine -> 2Nachkommastellen, Korr. Blatt 6: Zelle C58",null,"IWE / DFE"]

{"sheet":"Linear","index":2,"n_rows":69,"n_cols":12,"rows_kept":69,"merged":[[4,8,4,10]]}
[{"$nulls":3},{"$f":"Texte!A81","v":"Suisse-Bilanz: Lineare Korrektur"},{"$nulls":7},{"$f":"+Texte!A82","v":"Resultate"}]
[]
[null,{"$f":"+Texte!A83&\"    \"","v":"Betriebs-Nr:    "},{"$nulls":5},{"$f":"Texte!A89&\"    \"","v":"Berechnet durch:    "}]
[null,{"$f":"+Texte!A84&\"    \"","v":"Name:    "},{"$nulls":5},{"$f":"+Texte!A90&\"    \"","v":"Telefon-Nr.:    "}]
[null,{"$f":"+Texte!A85&\"    \"","v":"Vorname:    "},{"$nulls":5},{"$f":"+Texte!A91&\"    \"","v":"Fax / E-Mail:    "}]
[null,{"$f":"+Texte!A86&\"    \"","v":"Adresse:    "},{"$nulls":5},{"$f":"+Texte!A92&\"    \"","v":"Firma:    "}]
[null,{"$f":"+Texte!A87&\"    \"","v":"Adresszusatz:    "},{"$nulls":5},{"$f":"+Texte!A93&\"    \"","v":"Datum Anfang:    "}]
[null,{"$f":"+Texte!A88&\"    \"","v":"PLZ, Ort:    "},{"$nulls":5},{"$f":"+Texte!A94&\"    \"","v":"Datum Ende:    "}]
[{"$nulls":7},{"$f":"+Texte!A79&\"    \"","v":"Dauer:    "},{"$f":"IF(I7+I8=0,0,I8-I7+1)","v":0},{"$f":"+Texte!A80","v":"Tage"}]
[]
[]
[null,{"$f":"+Texte!A42","v":"Zusammenfassung der Futterzufuhr auf dem Betrieb"},{"$nulls":6},{"$f":"\"     \" &Texte!A43","v":"     kg Futter pro Tierkategorie"}]
[null,{"$f":"+Texte!A4","v":"Futterzufuhr"},null,{"$f":"+Texte!A25","v":"TS in %"},{"$f":"+Texte!A58","v":"MJ VES o. UEG"},{"$f":"+Texte!A28","v":"g RP"},{"$f":"+Texte!A29","v":"g P"},{"$f":"+Texte!A20","v":"Mastschweine"},{"$f":"+Texte!A21","v":"Zuchtschw./ Eber"},{"$f":"+Texte!A22","v":"Ferkel"},{"$f":"+Texte!A23","v":"Legehennen"},"%"]
[{"$nulls":7},1,2,3,4]
[]
[null,{"$f":"+'B1'!B6","v":0},null,{"$f":"+'B1'!C7","v":0},{"$f":"+'B1'!C9","v":{"v":0,"d":"0.0"}},{"$f":"+'B1'!C10","v":0},{"$f":"+'B1'!C11","v":{"v":0,"d":"0.0"}},{"$f":"+IF('B1'!$B$72=H14,SUM('B1'!C13:C56)-'B1'!C57,0)","v":0},{"$f":"+IF('B1'!$B$72=I14,SUM('B1'!C13:C56)-'B1'!C57,0)","v":0},{"$f":"+IF('B1'!$B$72=J14,SUM('B1'!C13:C56)-'B1'!C57,0)","v":0},{"$f":"+IF('B1'!$B$72=K14,SUM('B1'!C13:C56)-'B1'!C57,0)","v":0}]
[null,{"$f":"+'B1'!D6","v":0},null,{"$f":"+'B1'!E7","v":0},{"$f":"+'B1'!E9","v":{"v":0,"d":"0.0"}},{"$f":"+'B1'!E10","v":0},{"$f":"+'B1'!E11","v":{"v":0,"d":"0.0"}},{"$f":"IF('B1'!$D$72=H14,SUM('B1'!E13:E56)-'B1'!E57,0)","v":0},{"$f":"IF('B1'!$D$72=I14,SUM('B1'!E13:E56)-'B1'!E57,0)","v":0},{"$f":"IF('B1'!$D$72=J14,SUM('B1'!E13:E56)-'B1'!E57,0)","v":0},{"$f":"IF('B1'!$D$72=K14,SUM('B1'!E13:E56)-'B1'!E57,0)","v":0}]
[null,{"$f":"+'B1'!F6","v":0},null,{"$f":"+'B1'!G7","v":0},{"$f":"+'B1'!G9","v":{"v":0,"d":"0.0"}},{"$f":"+'B1'!G10","v":0},{"$f":"+'B1'!G11","v":{"v":0,"d":"0.0"}},{"$f":"IF('B1'!$F$72=Linear!H14,SUM('B1'!G13:G56)-'B1'!G57,0)","v":0},{"$f":"IF('B1'!$F$72=Linear!I14,SUM('B1'!G13:G56)-'B1'!G57,0)","v":0},{"$f":"IF('B1'!$F$72=Linear!J14,SUM('B1'!G13:G56)-'B1'!G57,0)","v":0},{"$f":"IF('B1'!$F$72=Linear!K14,SUM('B1'!G13:G56)-'B1'!G57,0)","v":0}]
[null,{"$f":"+'B1'!H6","v":0},null,{"$f":"+'B1'!I7","v":0},{"$f":"+'B1'!I9","v":{"v":0,"d":"0.0"}},{"$f":"+'B1'!I10","v":0},{"$f":"+'B1'!I11","v":{"v":0,"d":"0.0"}},{"$f":"IF('B1'!$H$72=Linear!H14,SUM('B1'!I13:I56)-'B1'!I57,0)","v":0},{"$f":"IF('B1'!$H$72=Linear!I14,SUM('B1'!I13:I56)-'B1'!I57,0)","v":0},{"$f":"IF('B1'!$H$72=Linear!J14,SUM('B1'!I13:I56)-'B1'!I57,0)","v":0},{"$f":"IF('B1'!$H$72=Linear!K14,SUM('B1'!I13:I56)-'B1'!I57,0)","v":0}]
[null,{"$f":"+'B2'!B6","v":0},null,{"$f":"+'B2'!C7","v":0},{"$f":"+'B2'!C9","v":{"v":0,"d":"0.0"}},{"$f":"+'B2'!C10","v":0},{"$f":"+'B2'!C11","v":{"v":0,"d":"0.0"}},{"$f":"IF('B2'!$B$72=Linear!H14,SUM('B2'!C13:C56)-'B2'!C57,0)","v":0},{"$f":"IF('B2'!$B$72=Linear!I14,SUM('B2'!C13:C56)-'B2'!C57,0)","v":0},{"$f":"IF('B2'!$B$72=Linear!J14,SUM('B2'!C13:C56)-'B2'!C57,0)","v":0},{"$f":"IF('B2'!$B$72=Linear!K14,SUM('B2'!C13:C56)-'B2'!C57,0)","v":0}]
[null,{"$f":"+'B2'!D6","v":0},null,{"$f":"+'B2'!E7","v":0},{"$f":"+'B2'!E9","v":{"v":0,"d":"0.0"}},{"$f":"+'B2'!E10","v":0},{"$f":"+'B2'!E11","v":{"v":0,"d":"0.0"}},{"$f":"IF('B2'!$D$72=Linear!H14,SUM('B2'!E13:E56)-'B2'!E57,0)","v":0},{"$f":"IF('B2'!$D$72=Linear!I14,SUM('B2'!E13:E56)-'B2'!E57,0)","v":0},{"$f":"IF('B2'!$D$72=Linear!J14,SUM('B2'!E13:E56)-'B2'!E57,0)","v":0},{"$f":"IF('B2'!$D$72=Linear!K14,SUM('B2'!E13:E56)-'B2'!E57,0)","v":0}]
[null,{"$f":"+'B2'!F6","v":0},null,{"$f":"+'B2'!G7","v":0},{"$f":"+'B2'!G9","v":{"v":0,"d":"0.0"}},{"$f":"+'B2'!G10","v":0},{"$f":"+'B2'!G11","v":{"v":0,"d":"0.0"}},{"$f":"IF('B2'!$F$72=H14,SUM('B2'!G13:G56)-'B2'!G57,0)","v":0},{"$f":"IF('B2'!$F$72=I14,SUM('B2'!G13:G56)-'B2'!G57,0)","v":0},{"$f":"IF('B2'!$F$72=J14,SUM('B2'!G13:G56)-'B2'!G57,0)","v":0},{"$f":"IF('B2'!$F$72=K14,SUM('B2'!G13:G56)-'B2'!G57,0)","v":0}]
[null,{"$f":"+'B2'!H6","v":0},null,{"$f":"+'B2'!I7","v":0},{"$f":"+'B2'!I9","v":{"v":0,"d":"0.0"}},{"$f":"+'B2'!I10","v":0},{"$f":"+'B2'!I11","v":{"v":0,"d":"0.0"}},{"$f":"+IF('B2'!$H$72=H14,SUM('B2'!I13:I56)-'B2'!I57,0)","v":0},{"$f":"+IF('B2'!$H$72=I14,SUM('B2'!I13:I56)-'B2'!I57,0)","v":0},{"$f":"+IF('B2'!$H$72=J14,SUM('B2'!I13:I56)-'B2'!I57,0)","v":0},{"$f":"+IF('B2'!$H$72=K14,SUM('B2'!I13:I56)-'B2'!I57,0)","v":0}]
[null,{"$f":"+'B3'!B6","v":0},null,{"$f":"+'B3'!C7","v":0},{"$f":"+'B3'!C9","v":{"v":0,"d":"0.0"}},{"$f":"+'B3'!C10","v":0},{"$f":"+'B3'!C11","v":{"v":0,"d":"0.0"}},{"$f":"IF('B3'!$B$72=H14,SUM('B3'!C13:C56)-'B3'!C57,0)","v":0},{"$f":"IF('B3'!$B$72=I14,SUM('B3'!C13:C56)-'B3'!C57,0)","v":0},{"$f":"IF('B3'!$B$72=J14,SUM('B3'!C13:C56)-'B3'!C57,0)","v":0},{"$f":"IF('B3'!$B$72=K14,SUM('B3'!C13:C56)-'B3'!C57,0)","v":0}]
[null,{"$f":"+'B3'!D6","v":0},null,{"$f":"+'B3'!E7","v":0},{"$f":"+'B3'!E9","v":{"v":0,"d":"0.0"}},{"$f":"+'B3'!E10","v":0},{"$f":"+'B3'!E11","v":{"v":0,"d":"0.0"}},{"$f":"IF('B3'!$D$72=H14,SUM('B3'!E13:E56)-'B3'!E57,0)","v":0},{"$f":"IF('B3'!$D$72=I14,SUM('B3'!E13:E56)-'B3'!E57,0)","v":0},{"$f":"IF('B3'!$D$72=J14,SUM('B3'!E13:E56)-'B3'!E57,0)","v":0},{"$f":"IF('B3'!$D$72=K14,SUM('B3'!E13:E56)-'B3'!E57,0)","v":0}]
[null,{"$f":"+'B3'!F6","v":0},null,{"$f":"+'B3'!G7","v":0},{"$f":"+'B3'!G9","v":{"v":0,"d":"0.0"}},{"$f":"+'B3'!G10","v":0},{"$f":"+'B3'!G11","v":{"v":0,"d":"0.0"}},{"$f":"IF('B3'!$F$72=Linear!H14,SUM('B3'!G13:G56)-'B3'!G57,0)","v":0},{"$f":"IF('B3'!$F$72=Linear!I14,SUM('B3'!G13:G56)-'B3'!G57,0)","v":0},{"$f":"IF('B3'!$F$72=Linear!J14,SUM('B3'!G13:G56)-'B3'!G57,0)","v":0},{"$f":"IF('B3'!$F$72=Linear!K14,SUM('B3'!G13:G56)-'B3'!G57,0)","v":0}]
[null,{"$f":"+'B3'!H6","v":0},null,{"$f":"+'B3'!I7","v":0},{"$f":"+'B3'!I9","v":{"v":0,"d":"0.0"}},{"$f":"+'B3'!I10","v":0},{"$f":"+'B3'!I11","v":{"v":0,"d":"0.0"}},{"$f":"IF('B3'!$H$72=H14,SUM('B3'!I13:I56)-'B3'!I57,0)","v":0},{"$f":"IF('B3'!$H$72=I14,SUM('B3'!I13:I56)-'B3'!I57,0)","v":0},{"$f":"IF('B3'!$H$72=J14,SUM('B3'!I13:I56)-'B3'!I57,0)","v":0},{"$f":"IF('B3'!$H$72=K14,SUM('B3'!I13:I56)-'B3'!I57,0)","v":0}]
[null,{"$f":"+'B4'!B9","v":0},null,100,{"$f":"+'B4'!C12","v":{"v":0,"d":"0.0"}},{"$f":"+'B4'!C13","v":0},{"$f":"+'B4'!C14","v":{"v":0,"d":"0.0"}},{"$f":"(SUM('B4'!C16:C56)-'B4'!C57)*'B4'!C10/100*'B4'!C5","v":0},{"$f":"(SUM('B4'!C16:C56)-'B4'!C57)*'B4'!C10/100*'B4'!C6","v":0},{"$f":"(SUM('B4'!C16:C56)-'B4'!C57)*'B4'!C10/100*'B4'!C7","v":0},{"$f":"(SUM('B4'!C16:C56)-'B4'!C57)*'B4'!C10/100*'B4'!C8","v":0},{"$f":"SUM('B4'!C5:C8)*100","v":0}]
[null,{"$f":"+'B4'!D9","v":0},null,100,{"$f":"+'B4'!E12","v":{"v":0,"d":"0.0"}},{"$f":"+'B4'!E13","v":0},{"$f":"+'B4'!E14","v":{"v":0,"d":"0.0"}},{"$f":"(SUM('B4'!E16:E56)-'B4'!E57)*'B4'!E10/100*'B4'!E5","v":0},{"$f":"(SUM('B4'!E16:E56)-'B4'!E57)*'B4'!E10/100*'B4'!E6","v":0},{"$f":"(SUM('B4'!E16:E56)-'B4'!E57)*'B4'!E10/100*'B4'!E7","v":0},{"$f":"(SUM('B4'!E16:E56)-'B4'!E57)*'B4'!E10/100*'B4'!E8","v":0},{"$f":"SUM('B4'!E5:E8)*100","v":0}]
[null,{"$f":"+'B4'!F9","v":0},null,100,{"$f":"+'B4'!G12","v":{"v":0,"d":"0.0"}},{"$f":"+'B4'!G13","v":0},{"$f":"+'B4'!G14","v":{"v":0,"d":"0.0"}},{"$f":"(SUM('B4'!G16:G56)-'B4'!G57)*'B4'!G10/100*'B4'!G5","v":0},{"$f":"(SUM('B4'!G16:G56)-'B4'!G57)*'B4'!G10/100*'B4'!G6","v":0},{"$f":"(SUM('B4'!G16:G56)-'B4'!G57)*'B4'!G10/100*'B4'!G7","v":0},{"$f":"(SUM('B4'!G16:G56)-'B4'!G57)*'B4'!G10/100*'B4'!G8","v":0},{"$f":"SUM('B4'!G5:G8)*100","v":0}]
[null,{"$f":"+'B4'!H9","v":0},null,100,{"$f":"+'B4'!I12","v":{"v":0,"d":"0.0"}},{"$f":"+'B4'!I13","v":0},{"$f":"+'B4'!I14","v":{"v":0,"d":"0.0"}},{"$f":"(SUM('B4'!I16:I56)-'B4'!I57)*'B4'!I10/100*'B4'!I5","v":0},{"$f":"(SUM('B4'!I16:I56)-'B4'!I57)*'B4'!I10/100*'B4'!I6","v":0},{"$f":"(SUM('B4'!I16:I56)-'B4'!I57)*'B4'!I10/100*'B4'!I7","v":0},{"$f":"(SUM('B4'!I16:I56)-'B4'!I57)*'B4'!I10/100*'B4'!I8","v":0},{"$f":"SUM('B4'!I5:I8)*100","v":0}]
[null,{"$f":"+'B5'!B9","v":"Schotte"},null,100,{"$f":"+'B5'!C12","v":14.6},{"$f":"+'B5'!C13","v":129},{"$f":"+'B5'!C14","v":7.3},{"$f":"(SUM('B5'!C16:C56)-'B5'!C57)*'B5'!C10/100*'B5'!C5","v":0},{"$f":"(SUM('B5'!C16:C56)-'B5'!C57)*'B5'!C10/100*'B5'!C6","v":0},{"$f":"(SUM('B5'!C16:C56)-'B5'!C57)*'B5'!C10/100*'B5'!C7","v":0},null,{"$f":"SUM('B5'!C5:C7)*100","v":0}]
[null,{"$f":"+'B5'!D9","v":"CCM"},null,100,{"$f":"+'B5'!E12","v":15.7},{"$f":"+'B5'!E13","v":95},{"$f":"+'B5'!E14","v":3.3},{"$f":"(SUM('B5'!E16:E56)-'B5'!E57)*'B5'!E10/100*'B5'!E5","v":0},{"$f":"(SUM('B5'!E16:E56)-'B5'!E57)*'B5'!E10/100*'B5'!E6","v":0},{"$f":"(SUM('B5'!E16:E56)-'B5'!E57)*'B5'!E10/100*'B5'!E7","v":0},null,{"$f":"SUM('B5'!E5:E7)*100","v":0}]
[null,{"$f":"+'B5'!F9","v":"Mais ganze Pflanze"},null,{"$f":"+'B5'!G10","v":100},{"$f":"+'B5'!G12","v":10.7},{"$f":"+'B5'!G13","v":75},{"$f":"+'B5'!G14","v":1.9},null,{"$f":"(SUM('B5'!G16:G56)-'B5'!G57)","v":0}]
[null,{"$f":"+'B5'!H9","v":"Wiesenfutter \n(Gras, Silo, ...)"},null,{"$f":"+'B5'!I10","v":100},{"$f":"+'B5'!I12","v":7.6},{"$f":"+'B5'!I13","v":155},{"$f":"+'B5'!I14","v":3.5},null,{"$f":"(SUM('B5'!I16:I56)-'B5'!I57)","v":0}]
[null,{"$f":"+'B6'!B9","v":"Stroh, Strohpellets"},null,100,{"$f":"+'B6'!C12","v":2.2},{"$f":"+'B6'!C13","v":35},{"$f":"+'B6'!C14","v":0.9},{"$f":"(SUM('B6'!C16:C56)-'B6'!C57)*'B6'!C10/100*'B6'!C5","v":0},{"$f":"(SUM('B6'!C16:C56)-'B6'!C57)*'B6'!C10/100*'B6'!C6","v":0},{"$f":"(SUM('B6'!C16:C56)-'B6'!C57)*'B6'!C10/100*'B6'!C7","v":0},{"$f":"(SUM('B6'!C16:C56)-'B6'!C57)*'B6'!C10/100*'B6'!C8","v":0}]
[null,{"$f":"+'B6'!D9","v":"Beschäftigungs-, Raufutterwürfel"},null,100,{"$f":"+'B6'!E12","v":2.1},{"$f":"+'B6'!E13","v":25},{"$f":"+'B6'!E14","v":1.6},{"$f":"(SUM('B6'!E16:E56)-'B6'!E57)*'B6'!E10/100*'B6'!E5","v":0},{"$f":"(SUM('B6'!E16:E56)-'B6'!E57)*'B6'!E10/100*'B6'!E6","v":0},{"$f":"(SUM('B6'!E16:E56)-'B6'!E57)*'B6'!E10/100*'B6'!E7","v":0}]
[]
[]
[null,{"$f":"+Texte!A44","v":"Zusammenfassung der Gehalte nach Tierkategorie"},{"$nulls":5},{"$f":"+H13","v":"Mastschweine"},{"$f":"+I13","v":"Zuchtschw./ Eber"},{"$f":"+J13","v":"Ferkel"},{"$f":"+K13","v":"Legehennen"}]
[null,{"$f":"+Texte!A45","v":"Verfütterte Trockensubstanz"},{"$nulls":3},{"$f":"+Texte!A50","v":"kg TS"},null,{"$f":"H16*$D16/100+H17*$D17/100+H18*$D18/100+H19*$D19/100+H20*$D20/100+H21*$D21/100+H22*$D22/100+H23*$D23/100+H24*$D24/100+H25*$D25/100+H26*$D26/100+H27*$D27/100+H28*$D28/100+H29*$D29/100+H30*$D30/100+H31*$D31/100+H32*$D32/100+H33*$D33/100+H34*$D34/100+H35*$D35/100","v":0},{"$f":"+I16*$D16/100+I17*$D17/100+I18*$D18/100+I19*$D19/100+I20*$D20/100+I21*$D21/100+I22*$D22/100+I23*$D23/100+I24*$D24/100+I25*$D25/100+I26*$D26/100+I27*$D27/100+I28*$D28/100+I29*$D29/100+I30*$D30/100+I31*$D31/100+I32*$D32/100+I33*$D33/100+I34*$D34/100+I35*$D35/100","v":0},{"$f":"+J16*$D16/100+J17*$D17/100+J18*$D18/100+J19*$D19/100+J20*$D20/100+J21*$D21/100+J22*$D22/100+J23*$D23/100+J24*$D24/100+J25*$D25/100+J26*$D26/100+J27*$D27/100+J28*$D28/100+J29*$D29/100+J30*$D30/100+J31*$D31/100+J32*$D32/100+J33*$D33/100+J34*$D34/100+J35*$D35/100","v":0},{"$f":"+K16*$D16/100+K17*$D17/100+K18*$D18/100+K19*$D19/100+K20*$D20/100+K21*$D21/100+K22*$D22/100+K23*$D23/100+K24*$D24/100+K25*$D25/100+K26*$D26/100+K27*$D27/100+K28*$D28/100+K29*$D29/100+K30*$D30/100+K31*$D31/100+K32*$D32/100+K33*$D33/100+K34*$D34/100+K35*$D35/100","v":0}]
[null,{"$f":"+Texte!A46","v":"Menge Futter in 88% TS"},{"$nulls":3},"kg",null,{"$f":"+H41/0.88","v":0},{"$f":"+I41/0.88","v":0},{"$f":"+J41/0.88","v":0},{"$f":"+K41/0.88","v":0}]
[null,{"$f":"+Texte!A47","v":"Total Energie"},{"$nulls":3},{"$f":"+E13","v":"MJ VES o. UEG"},null,{"$f":"+H16*$E16+H17*$E17+H18*$E18+H19*$E19+H20*$E20+H21*$E21+H22*$E22+H23*$E23+H24*$E24+H25*$E25+H26*$E26+H27*$E27+H28*$E28+H29*$E29+H30*$E30+H31*$E31+H32*$E32+H33*$E33+H34*$E34+H35*$E35","v":0},{"$f":"+I16*$E16+I17*$E17+I18*$E18+I19*$E19+I20*$E20+I21*$E21+I22*$E22+I23*$E23+I24*$E24+I25*$E25+I26*$E26+I27*$E27+I28*$E28+I29*$E29+I30*$E30+I31*$E31+I32*$E32+I33*$E33+I34*$E34+I35*$E35","v":0},{"$f":"+J16*$E16+J17*$E17+J18*$E18+J19*$E19+J20*$E20+J21*$E21+J22*$E22+J23*$E23+J24*$E24+J25*$E25+J26*$E26+J27*$E27+J28*$E28+J29*$E29+J30*$E30+J31*$E31+J32*$E32+J33*$E33+J34*$E34+J35*$E35","v":0},{"$f":"+K16*$E16+K17*$E17+K18*$E18+K19*$E19+K20*$E20+K21*$E21+K22*$E22+K23*$E23+K24*$E24+K25*$E25+K26*$E26+K27*$E27+K28*$E28+K29*$E29+K30*$E30+K31*$E31+K32*$E32+K33*$E33+K34*$E34+K35*$E35","v":0}]
[null,{"$f":"+Texte!A48","v":"Total Protein"},{"$nulls":3},{"$f":"+F13","v":"g RP"},null,{"$f":"+H16*$F16+H17*$F17+H18*$F18+H19*$F19+H20*$F20+H21*$F21+H22*$F22+H23*$F23+H24*$F24+H25*$F25+H26*$F26+H27*$F27+H28*$F28+H29*$F29+H30*$F30+H31*$F31+H32*$F32+H33*$F33+H34*$F34+H35*$F35","v":0},{"$f":"+I16*$F16+I17*$F17+I18*$F18+I19*$F19+I20*$F20+I21*$F21+I22*$F22+I23*$F23+I24*$F24+I25*$F25+I26*$F26+I27*$F27+I28*$F28+I29*$F29+I30*$F30+I31*$F31+I32*$F32+I33*$F33+I34*$F34+I35*$F35","v":0},{"$f":"+J16*$F16+J17*$F17+J18*$F18+J19*$F19+J20*$F20+J21*$F21+J22*$F22+J23*$F23+J24*$F24+J25*$F25+J26*$F26+J27*$F27+J28*$F28+J29*$F29+J30*$F30+J31*$F31+J32*$F32+J33*$F33+J34*$F34+J35*$F35","v":0},{"$f":"+K16*$F16+K17*$F17+K18*$F18+K19*$F19+K20*$F20+K21*$F21+K22*$F22+K23*$F23+K24*$F24+K25*$F25+K26*$F26+K27*$F27+K28*$F28+K29*$F29+K30*$F30+K31*$F31+K32*$F32+K33*$F33+K34*$F34+K35*$F35","v":0}]
[null,{"$f":"+Texte!A49","v":"Total Phosphor"},{"$nulls":3},{"$f":"+G13","v":"g P"},null,{"$f":"+H16*$G16+H17*$G17+H18*$G18+H19*$G19+H20*$G20+H21*$G21+H22*$G22+H23*$G23+H24*$G24+H25*$G25+H26*$G26+H27*$G27+H28*$G28+H29*$G29+H30*$G30+H31*$G31+H32*$G32+H33*$G33+H34*$G34+H35*$G35","v":0},{"$f":"+I16*$G16+I17*$G17+I18*$G18+I19*$G19+I20*$G20+I21*$G21+I22*$G22+I23*$G23+I24*$G24+I25*$G25+I26*$G26+I27*$G27+I28*$G28+I29*$G29+I30*$G30+I31*$G31+I32*$G32+I33*$G33+I34*$G34+I35*$G35","v":0},{"$f":"+J16*$G16+J17*$G17+J18*$G18+J19*$G19+J20*$G20+J21*$G21+J22*$G22+J23*$G23+J24*$G24+J25*$G25+J26*$G26+J27*$G27+J28*$G28+J29*$G29+J30*$G30+J31*$G31+J32*$G32+J33*$G33+J34*$G34+J35*$G35","v":0},{"$f":"+K16*$G16+K17*$G17+K18*$G18+K19*$G19+K20*$G20+K21*$G21+K22*$G22+K23*$G23+K24*$G24+K25*$G25+K26*$G26+K27*$G27+K28*$G28+K29*$G29+K30*$G30+K31*$G31+K32*$G32+K33*$G33+K34*$G34+K35*$G35","v":0}]
[]
[{"$nulls":7},{"$f":"\"                    \"&Texte!A51","v":"                    Durchschnittsgehalt pro kg Futter 88%"}]
[null,{"$f":"+Texte!A52","v":"Durchschnittsgehalt Energie"},{"$nulls":3},{"$f":"+F43&\" / kg\"","v":"MJ VES o. UEG / kg"},null,{"$f":"IF(H42<>0,H43/H42,0)","v":{"v":0,"d":"0.0"}},{"$f":"IF(I42<>0,I43/I42,0)","v":{"v":0,"d":"0.0"}},{"$f":"IF(J42<>0,J43/J42,0)","v":{"v":0,"d":"0.0"}},{"$f":"IF(K42<>0,K43/K42,0)","v":{"v":0,"d":"0.0"}}]
[null,{"$f":"+Texte!A53","v":"Durchschnittsgehalt Protein "},{"$nulls":3},{"$f":"+F44&\" / kg\"","v":"g RP / kg"},null,{"$f":"IF(H42<>0,H44/H42,0)","v":0},{"$f":"IF(I42<>0,I44/I42,0)","v":0},{"$f":"IF(J42<>0,J44/J42,0)","v":0},{"$f":"IF(K42<>0,K44/K42,0)","v":0}]
[null,{"$f":"+Texte!A54","v":"Durchschnittsgehalt Phosphor"},{"$nulls":3},{"$f":"+F45&\" / kg\"","v":"g P / kg"},null,{"$f":"IF(H42<>0,H45/H42,0)","v":{"v":0,"d":"0.0"}},{"$f":"IF(I42<>0,I45/I42,0)","v":{"v":0,"d":"0.0"}},{"$f":"IF(J42<>0,J45/J42,0)","v":{"v":0,"d":"0.0"}},{"$f":"IF(K42<>0,K45/K42,0)","v":{"v":0,"d":"0.0"}}]
[null,{"$f":"+Texte!A56","v":"Durchschnittsgehalt Schweine"},{"$nulls":3},{"$f":"Texte!A59","v":"g RP / MJ VES"},null,{"$f":"IF(SUM(H43:J43)<>0,SUM(H44:J44)/SUM(H43:J43),\"\")","v":""}]
[]
[]
[null,{"$f":"+Texte!A60","v":"Maximale Stallplätze und durchschnittliche Anzahl"},{"$nulls":5},{"$f":"Texte!A62","v":"Maximale Anz."},{"$f":"Texte!A64","v":"Durchschn."},{"$f":"+Texte!A73","v":"Tiere"}]
[null,{"$f":"+Texte!A61","v":"Tiere auf dem Betrieb in dieser Periode"},{"$nulls":5},{"$f":"Texte!A63","v":"Stallplätze"},{"$f":"Texte!A65","v":"besetzte Pl."},{"$f":"+Texte!A74","v":"pro Jahr"}]
[null,1639,{"$f":"+Texte!A66","v":"Mastschweine und Remonten < 6 Mte"}]
[null,1631,{"$f":"+Texte!A67","v":"Abgesetzte Ferkel bis 26 kg LG"}]
[null,1621,{"$f":"+Texte!A68","v":"Zuchteber"}]
[null,1615,{"$f":"+Texte!A69","v":"Nicht säugende Zuchtsauen > 6 Mte"}]
[null,1611,{"$f":"+Texte!A70","v":"Säugende Zuchtsauen"}]
[null,1753,{"$f":"+Texte!A71","v":"Legehennen"}]
[null,1754,{"$f":"+Texte!A72","v":"Bruteierproduzierende Hennen, Hähne"}]
[]
[]
[null,{"$f":"+Texte!A57","v":"Der Betriebsleiter bestätigt die Vollständigkeit der Angaben auf diesem Blatt, wie auch auf den Aufzeichnungen zu den Futterzufuhren."}]
[]
[null,{"$f":"+'B5'!B63","v":"Kantonale Kontrollstelle, Datum:"},{"$nulls":5},{"$f":"+'B5'!F63","v":"Unterschrift:"}]
[]
[null,{"$f":"+'B5'!B65","v":"Betriebsleiter, Datum:"},{"$nulls":5},{"$f":"+H67","v":"Unterschrift:"}]

{"sheet":"B1","index":3,"n_rows":72,"n_cols":9,"rows_kept":72}
[{"$nulls":3},{"$f":"Linear!D1","v":"Suisse-Bilanz: Lineare Korrektur"},{"$nulls":4},{"$f":"\"B1: \"&Texte!A3","v":"B1: Mischfutterzufuhr"}]
[null,{"$f":"Linear!B3 & IF(Linear!C3=0,\"\",Linear!C3)","v":"Betriebs-Nr:    "},{"$nulls":3},{"$f":"Linear!B4 &IF(Linear!C4=0,\"\",Linear!C5 & \" \" &Linear!C4)","v":"Name:    "}]
[]
[null,{"$f":"+Texte!A6","v":"Tiere"},null,{"$f":"+B4","v":"Tiere"},null,{"$f":"+D4","v":"Tiere"},null,{"$f":"+F4","v":"Tiere"}]
[null,{"$f":"IF(B72=1,Texte!A20,IF(B72=2,Texte!A21,IF(B72=3,Texte!A22,IF(B72=4,Texte!A23,IF(B72=5,Texte!A24)))))","v":"Mastschweine"},null,{"$f":"IF(D72=1,Texte!A20,IF(D72=2,Texte!A21,IF(D72=3,Texte!A22,IF(D72=4,Texte!A23,IF(D72=5,Texte!A24)))))","v":"Mastschweine"},null,{"$f":"IF(F72=1,Texte!A20,IF(F72=2,Texte!A21,IF(F72=3,Texte!A22,IF(F72=4,Texte!A23,IF(F72=5,Texte!A24)))))","v":"Mastschweine"},null,{"$f":"IF(H72=1,Texte!A20,IF(H72=2,Texte!A21,IF(H72=3,Texte!A22,IF(H72=4,Texte!A23,IF(H72=5,Texte!A24)))))","v":"Mastschweine"}]
[]
[null,{"$f":"+Texte!A25","v":"TS in %"},null,{"$f":"+B7","v":"TS in %"},null,{"$f":"+B7","v":"TS in %"},null,{"$f":"+B7","v":"TS in %"}]
[null,{"$f":"+Texte!A7","v":"pro kg Futter"},null,{"$f":"+B8","v":"pro kg Futter"},null,{"$f":"+D8","v":"pro kg Futter"},null,{"$f":"+F8","v":"pro kg Futter"}]
[null,{"$f":"IF(B72=5,Texte!A26,Texte!A27)","v":"MJ VES/UEG"},null,{"$f":"IF(D72=5,Texte!A26,Texte!A27)","v":"MJ VES/UEG"},null,{"$f":"IF(F72=5,Texte!A26,Texte!A27)","v":"MJ VES/UEG"},null,{"$f":"IF(H72=5,Texte!A26,Texte!A27)","v":"MJ VES/UEG"}]
[null,{"$f":"+Texte!A28","v":"g RP"},null,{"$f":"B10","v":"g RP"},null,{"$f":"B10","v":"g RP"},null,{"$f":"B10","v":"g RP"}]
[null,{"$f":"+Texte!A29","v":"g P"},null,{"$f":"B11","v":"g P"},null,{"$f":"B11","v":"g P"},null,{"$f":"B11","v":"g P"}]
[null,{"$f":"+Texte!A8","v":"Datum"},{"$f":"+Texte!A9","v":"kg Futter"},{"$f":"+B12","v":"Datum"},"kg Futter","Datum","kg Futter","Datum","kg Futter"]
[null,{"$f":"+Texte!A76","v":"Anfang"},null,{"$f":"+B13","v":"Anfang"},null,{"$f":"+D13","v":"Anfang"},null,{"$f":"+F13","v":"Anfang"}]
{"$rows_empty":43}
[null,{"$f":"+Texte!A77","v":"Ende"},null,{"$f":"+B57","v":"Ende"},null,{"$f":"+D57","v":"Ende"},null,{"$f":"+F57","v":"Ende"}]
[null,{"$f":"+Texte!A10","v":"Total Zufuhr"},{"$f":"IF(SUM(C13:C57)=0,0,SUM(C13:C56)-C57)","v":0},{"$f":"+B58","v":"Total Zufuhr"},{"$f":"IF(SUM(E13:E57)=0,0,SUM(E13:E56)-E57)","v":0},{"$f":"+D58","v":"Total Zufuhr"},{"$f":"IF(SUM(G13:G57)=0,0,SUM(G13:G56)-G57)","v":0},{"$f":"+F58","v":"Total Zufuhr"},{"$f":"IF(SUM(I13:I57)=0,0,SUM(I13:I56)-I57)","v":0}]
[]
[null,{"$f":"+Texte!A13","v":"Es müssen alle eingesetzten Futtermittel erfasst werden."}]
[]
[null,{"$f":"+Texte!A30","v":"Kantonale Kontrollstelle, Datum:"},{"$nulls":3},{"$f":"+Texte!A31","v":"Unterschrift:"}]
[]
[null,{"$f":"+Texte!A32","v":"Betriebsleiter, Datum:"},{"$nulls":3},{"$f":"+F62","v":"Unterschrift:"}]
{"$rows_empty":7}
[null,1,null,1,null,1,null,1]

{"sheet":"B2","index":4,"n_rows":72,"n_cols":10,"rows_kept":72}
[{"$nulls":3},{"$f":"Linear!D1","v":"Suisse-Bilanz: Lineare Korrektur"},{"$nulls":4},{"$f":"\"B2: \"&Texte!A3","v":"B2: Mischfutterzufuhr"}]
[null,{"$f":"Linear!B3 & IF(Linear!C3=0,\"\",Linear!C3)","v":"Betriebs-Nr:    "},{"$nulls":3},{"$f":"Linear!B4 &IF(Linear!C4=0,\"\",Linear!C5 & \" \" &Linear!C4)","v":"Name:    "}]
[]
[null,{"$f":"+'B1'!B4","v":"Tiere"},null,{"$f":"+B4","v":"Tiere"},null,{"$f":"+D4","v":"Tiere"},null,{"$f":"+F4","v":"Tiere"}]
[null,{"$f":"IF(B72=1,Texte!A20,IF(B72=2,Texte!A21,IF(B72=3,Texte!A22,IF(B72=4,Texte!A23,IF(B72=5,Texte!A24)))))","v":"Mastschweine"},null,{"$f":"IF(D72=1,Texte!A20,IF(D72=2,Texte!A21,IF(D72=3,Texte!A22,IF(D72=4,Texte!A23,IF(D72=5,Texte!A24)))))","v":"Mastschweine"},null,{"$f":"IF(F72=1,Texte!A20,IF(F72=2,Texte!A21,IF(F72=3,Texte!A22,IF(F72=4,Texte!A23,IF(F72=5,Texte!A24)))))","v":"Mastschweine"},null,{"$f":"IF(H72=1,Texte!A20,IF(H72=2,Texte!A21,IF(H72=3,Texte!A22,IF(H72=4,Texte!A23,IF(H72=5,Texte!A24)))))","v":"Mastschweine"}]
[]
[null,{"$f":"+'B1'!B7","v":"TS in %"},null,{"$f":"+B7","v":"TS in %"},null,{"$f":"+D7","v":"TS in %"},null,{"$f":"+F7","v":"TS in %"}]
[null,{"$f":"+'B1'!B8","v":"pro kg Futter"},null,{"$f":"+B8","v":"pro kg Futter"},null,{"$f":"+D8","v":"pro kg Futter"},null,{"$f":"+F8","v":"pro kg Futter"}]
[null,{"$f":"IF(B72=5,Texte!A26,Texte!A27)","v":"MJ VES/UEG"},null,{"$f":"IF(D72=5,Texte!A26,Texte!A27)","v":"MJ VES/UEG"},null,{"$f":"IF(F72=5,Texte!A26,Texte!A27)","v":"MJ VES/UEG"},null,{"$f":"IF(H72=5,Texte!A26,Texte!A27)","v":"MJ VES/UEG"}]
[null,{"$f":"+'B1'!B10","v":"g RP"},null,{"$f":"'B1'!B10","v":"g RP"},null,{"$f":"'B1'!B10","v":"g RP"},null,{"$f":"'B1'!B10","v":"g RP"}]
[null,{"$f":"+'B1'!B11","v":"g P"},null,{"$f":"'B1'!B11","v":"g P"},null,{"$f":"'B1'!B11","v":"g P"},null,{"$f":"'B1'!B11","v":"g P"}]
[null,{"$f":"+'B1'!B12","v":"Datum"},{"$f":"+'B1'!C12","v":"kg Futter"},{"$f":"+B12","v":"Datum"},"kg Futter","Datum","kg Futter","Datum","kg Futter"]
[null,{"$f":"+'B1'!B13","v":"Anfang"},null,{"$f":"+B13","v":"Anfang"},null,{"$f":"+D13","v":"Anfang"},null,{"$f":"+F13","v":"Anfang"}]
{"$rows_empty":43}
[null,{"$f":"+'B1'!B57","v":"Ende"},null,{"$f":"+B57","v":"Ende"},null,{"$f":"+D57","v":"Ende"},null,{"$f":"+F57","v":"Ende"}]
[null,{"$f":"+'B1'!B58","v":"Total Zufuhr"},{"$f":"IF(SUM(C13:C57)=0,0,SUM(C13:C56)-C57)","v":0},{"$f":"+B58","v":"Total Zufuhr"},{"$f":"IF(SUM(E13:E57)=0,0,SUM(E13:E56)-E57)","v":0},{"$f":"+D58","v":"Total Zufuhr"},{"$f":"IF(SUM(G13:G57)=0,0,SUM(G13:G56)-G57)","v":0},{"$f":"+F58","v":"Total Zufuhr"},{"$f":"IF(SUM(I13:I57)=0,0,SUM(I13:I56)-I57)","v":0}]
[]
[null,{"$f":"+'B1'!B60","v":"Es müssen alle eingesetzten Futtermittel erfasst werden."}]
[]
[null,{"$f":"+'B1'!B62","v":"Kantonale Kontrollstelle, Datum:"},{"$nulls":3},{"$f":"+'B1'!F62","v":"Unterschrift:"}]
[]
[null,{"$f":"+'B1'!B64","v":"Betriebsleiter, Datum:"},{"$nulls":3},{"$f":"+F62","v":"Unterschrift:"}]
[{"$nulls":9},".........................................…"]
[]
[]
[]
[]
[]
[]
[null,1,null,1,null,1,null,1]

{"sheet":"B3","index":5,"n_rows":72,"n_cols":9,"rows_kept":72}
[{"$nulls":3},{"$f":"Linear!D1","v":"Suisse-Bilanz: Lineare Korrektur"},{"$nulls":4},{"$f":"\"B3: \"&Texte!A3","v":"B3: Mischfutterzufuhr"}]
[null,{"$f":"Linear!B3 & IF(Linear!C3=0,\"\",Linear!C3)","v":"Betriebs-Nr:    "},{"$nulls":3},{"$f":"Linear!B4 &IF(Linear!C4=0,\"\",Linear!C5 & \" \" &Linear!C4)","v":"Name:    "}]
[]
[null,{"$f":"+'B2'!B4:C4","v":"Tiere"},null,{"$f":"+B4","v":"Tiere"},null,{"$f":"+D4","v":"Tiere"},null,{"$f":"+F4","v":"Tiere"}]
[null,{"$f":"IF(B72=1,Texte!A20,IF(B72=2,Texte!A21,IF(B72=3,Texte!A22,IF(B72=4,Texte!A23,IF(B72=5,Texte!A24)))))","v":"Mastschweine"},null,{"$f":"IF(D72=1,Texte!A20,IF(D72=2,Texte!A21,IF(D72=3,Texte!A22,IF(D72=4,Texte!A23,IF(D72=5,Texte!A24)))))","v":"Mastschweine"},null,{"$f":"IF(F72=1,Texte!A20,IF(F72=2,Texte!A21,IF(F72=3,Texte!A22,IF(F72=4,Texte!A23,IF(F72=5,Texte!A24)))))","v":"Mastschweine"},null,{"$f":"IF(H72=1,Texte!A20,IF(H72=2,Texte!A21,IF(H72=3,Texte!A22,IF(H72=4,Texte!A23,IF(H72=5,Texte!A24)))))","v":"Mastschweine"}]
[]
[null,{"$f":"+'B2'!B7","v":"TS in %"},null,{"$f":"+B7","v":"TS in %"},null,{"$f":"+B7","v":"TS in %"},null,{"$f":"+B7","v":"TS in %"}]
[null,{"$f":"+'B2'!B8","v":"pro kg Futter"},null,{"$f":"+B8","v":"pro kg Futter"},null,{"$f":"+D8","v":"pro kg Futter"},null,{"$f":"+F8","v":"pro kg Futter"}]
[null,{"$f":"IF(B72=5,Texte!A26,Texte!A27)","v":"MJ VES/UEG"},null,{"$f":"IF(D72=5,Texte!A26,Texte!A27)","v":"MJ VES/UEG"},null,{"$f":"IF(F72=5,Texte!A26,Texte!A27)","v":"MJ VES/UEG"},null,{"$f":"IF(H72=5,Texte!A26,Texte!A27)","v":"MJ VES/UEG"}]
[null,{"$f":"'B1'!B10","v":"g RP"},null,{"$f":"'B1'!B10","v":"g RP"},null,{"$f":"'B1'!B10","v":"g RP"},null,{"$f":"'B1'!B10","v":"g RP"}]
[null,{"$f":"'B1'!B11","v":"g P"},null,{"$f":"'B1'!B11","v":"g P"},null,{"$f":"'B1'!B11","v":"g P"},null,{"$f":"'B1'!B11","v":"g P"}]
[null,{"$f":"+'B2'!B12","v":"Datum"},{"$f":"+'B2'!C12","v":"kg Futter"},{"$f":"+B12","v":"Datum"},"kg Futter","Datum","kg Futter","Datum","kg Futter"]
[null,{"$f":"+'B2'!B13","v":"Anfang"},null,{"$f":"+B13","v":"Anfang"},null,{"$f":"+D13","v":"Anfang"},null,{"$f":"+F13","v":"Anfang"}]
{"$rows_empty":43}
[null,{"$f":"+'B2'!B57","v":"Ende"},null,{"$f":"+B57","v":"Ende"},null,{"$f":"+D57","v":"Ende"},null,{"$f":"+F57","v":"Ende"}]
[null,{"$f":"+'B2'!B58","v":"Total Zufuhr"},{"$f":"IF(SUM(C13:C57)=0,0,SUM(C13:C56)-C57)","v":0},{"$f":"+B58","v":"Total Zufuhr"},{"$f":"IF(SUM(E13:E57)=0,0,SUM(E13:E56)-E57)","v":0},{"$f":"+D58","v":"Total Zufuhr"},{"$f":"IF(SUM(G13:G57)=0,0,SUM(G13:G56)-G57)","v":0},{"$f":"+F58","v":"Total Zufuhr"},{"$f":"IF(SUM(I13:I57)=0,0,SUM(I13:I56)-I57)","v":0}]
[]
[null,{"$f":"+'B1'!B60","v":"Es müssen alle eingesetzten Futtermittel erfasst werden."}]
[]
[null,{"$f":"+'B2'!B62","v":"Kantonale Kontrollstelle, Datum:"},{"$nulls":3},{"$f":"+'B2'!F62","v":"Unterschrift:"}]
[]
[null,{"$f":"+'B2'!B64","v":"Betriebsleiter, Datum:"},{"$nulls":3},{"$f":"+F62","v":"Unterschrift:"}]
{"$rows_empty":7}
[null,1,null,1,null,1,null,1]

{"sheet":"B4","index":6,"n_rows":73,"n_cols":9,"rows_kept":73}
[{"$nulls":3},{"$f":"Linear!D1","v":"Suisse-Bilanz: Lineare Korrektur"},{"$nulls":4},{"$f":"\"B4: \"&Texte!A4","v":"B4: Futterzufuhr"}]
[null,{"$f":"Linear!B3 & IF(Linear!C3=0,\"\",Linear!C3)","v":"Betriebs-Nr:    "},{"$nulls":3},{"$f":"Linear!B4 &IF(Linear!C4=0,\"\",Linear!C5 & \" \" &Linear!C4)","v":"Name:    "}]
[null,{"$f":"IF(AND(SUM(C5:C8)<>100%,C10<>0),Texte!$A$33,\"\")","v":""},null,{"$f":"IF(AND(SUM(E5:E8)<>100%,E10<>0),Texte!$A$33,\"\")","v":""},null,{"$f":"IF(AND(SUM(G5:G8)<>100%,G10<>0),Texte!$A$33,\"\")","v":""},null,{"$f":"IF(AND(SUM(I5:I8)<>100%,I10<>0),Texte!$A$33,\"\")","v":""}]
[null,{"$f":"+Texte!A41","v":"Aufteilung in %"},null,{"$f":"+B4","v":"Aufteilung in %"},null,{"$f":"+D4","v":"Aufteilung in %"},null,{"$f":"+F4","v":"Aufteilung in %"}]
[null,{"$f":"+Texte!A20","v":"Mastschweine"},null,{"$f":"+B5","v":"Mastschweine"},null,{"$f":"+D5","v":"Mastschweine"},null,{"$f":"+F5","v":"Mastschweine"}]
[null,{"$f":"+Texte!A21","v":"Zuchtschw./ Eber"},null,{"$f":"+B6","v":"Zuchtschw./ Eber"},null,{"$f":"+D6","v":"Zuchtschw./ Eber"},null,{"$f":"+F6","v":"Zuchtschw./ Eber"}]
[null,{"$f":"+Texte!A22","v":"Ferkel"},null,{"$f":"+B7","v":"Ferkel"},null,{"$f":"+D7","v":"Ferkel"},null,{"$f":"+F7","v":"Ferkel"}]
[null,{"$f":"+Texte!A23","v":"Legehennen"},null,{"$f":"+B8","v":"Legehennen"},null,{"$f":"+D8","v":"Legehennen"},null,{"$f":"+F8","v":"Legehennen"}]
[]
[null,{"$f":"+'B2'!B7","v":"TS in %"},null,{"$f":"+B10","v":"TS in %"},null,{"$f":"+B10","v":"TS in %"},null,{"$f":"+B10","v":"TS in %"}]
[null,{"$f":"+Texte!A17","v":"pro kg TS"},null,{"$f":"+B11","v":"pro kg TS"},null,{"$f":"+D11","v":"pro kg TS"},null,{"$f":"+F11","v":"pro kg TS"}]
[null,{"$f":"Texte!A27","v":"MJ VES/UEG"},null,{"$f":"Texte!A27","v":"MJ VES/UEG"},null,{"$f":"Texte!A27","v":"MJ VES/UEG"},null,{"$f":"Texte!A27","v":"MJ VES/UEG"}]
[null,{"$f":"'B1'!B10","v":"g RP"},null,{"$f":"'B1'!B10","v":"g RP"},null,{"$f":"'B1'!B10","v":"g RP"},null,{"$f":"'B1'!B10","v":"g RP"}]
[null,{"$f":"'B1'!B11","v":"g P"},null,{"$f":"'B1'!B11","v":"g P"},null,{"$f":"'B1'!B11","v":"g P"},null,{"$f":"'B1'!B11","v":"g P"}]
[null,{"$f":"+'B2'!B12","v":"Datum"},{"$f":"+Texte!A16","v":"kg FS"},{"$f":"+B15","v":"Datum"},"kg FS","Datum","kg FS","Datum","kg FS"]
[null,{"$f":"+'B3'!B13","v":"Anfang"},null,{"$f":"+B16","v":"Anfang"},null,{"$f":"+D16","v":"Anfang"},null,{"$f":"+F16","v":"Anfang"}]
{"$rows_empty":40}
[null,{"$f":"+'B3'!B57","v":"Ende"},null,{"$f":"+B57","v":"Ende"},null,{"$f":"+D57","v":"Ende"},null,{"$f":"+F57","v":"Ende"}]
[null,{"$f":"+Texte!A14","v":"In kg FS"},{"$f":"IF(SUM(C5:C8)<>100%,0,SUM(C16:C56)-C57)","v":0},{"$f":"+B58","v":"In kg FS"},{"$f":"IF(SUM(E5:E8)<>100%,0,SUM(E16:E56)-E57)","v":0},{"$f":"+D58","v":"In kg FS"},{"$f":"IF(SUM(G5:G8)<>100%,0,SUM(G16:G56)-G57)","v":0},{"$f":"+F58","v":"In kg FS"},{"$f":"IF(SUM(I5:I8)<>100%,0,SUM(I16:I56)-I57)","v":0}]
[null,{"$f":"+Texte!A15","v":"In kg TS"},{"$f":"IF(C10<>\"\",C58*C10/100,0)","v":0},{"$f":"+B59","v":"In kg TS"},{"$f":"IF(E10<>\"\",E58*E10/100,0)","v":0},{"$f":"+D59","v":"In kg TS"},{"$f":"IF(G10<>\"\",G58*G10/100,0)","v":0},{"$f":"+F59","v":"In kg TS"},{"$f":"IF(I10<>\"\",I58*I10/100,0)","v":0}]
[]
[null,{"$f":"+'B1'!B60","v":"Es müssen alle eingesetzten Futtermittel erfasst werden."}]
[]
[null,{"$f":"+'B2'!B62","v":"Kantonale Kontrollstelle, Datum:"},{"$nulls":3},{"$f":"+'B2'!F62","v":"Unterschrift:"}]
[]
[null,{"$f":"+'B2'!B64","v":"Betriebsleiter, Datum:"},{"$nulls":3},{"$f":"+F63","v":"Unterschrift:"}]
{"$rows_empty":7}
[null,4,null,2,null,3,null,4]

{"sheet":"B5","index":7,"n_rows":73,"n_cols":9,"rows_kept":73,"merged":[[8,1,8,2],[8,3,8,4],[8,5,8,6],[8,7,8,8]]}
[{"$nulls":3},{"$f":"Linear!D1","v":"Suisse-Bilanz: Lineare Korrektur"},{"$nulls":4},{"$f":"\"B5: \"&Texte!A4","v":"B5: Futterzufuhr"}]
[null,{"$f":"Linear!B3 & IF(Linear!C3=0,\"\",Linear!C3)","v":"Betriebs-Nr:    "},{"$nulls":3},{"$f":"Linear!B4 &IF(Linear!C4=0,\"\",Linear!C5 & \" \" &Linear!C4)","v":"Name:    "}]
[null,{"$f":"IF(SUM(C5:C7)=0%,0,IF(SUM(C5:C7)<>100%,Texte!$A$33,\"\"))","v":0},null,{"$f":"IF(SUM(E5:E7)=0%,0,IF(SUM(E5:E7)<>100%,Texte!$A$33,\"\"))","v":0}]
[null,{"$f":"+'B4'!H4","v":"Aufteilung in %"},null,{"$f":"+B4","v":"Aufteilung in %"},null,{"$f":"+Texte!A24","v":"In kg TS erfassen"},null,{"$f":"+F4","v":"In kg TS erfassen"}]
[null,{"$f":"+Texte!A20","v":"Mastschweine"},null,{"$f":"+B5","v":"Mastschweine"}]
[null,{"$f":"+Texte!A21","v":"Zuchtschw./ Eber"},null,{"$f":"+B6","v":"Zuchtschw./ Eber"},null,{"$f":"+D6","v":"Zuchtschw./ Eber"},{"v":1,"d":"100%"},{"$f":"+F6","v":"Zuchtschw./ Eber"},{"v":1,"d":"100%"}]
[null,{"$f":"+Texte!A22","v":"Ferkel"},null,{"$f":"+B7","v":"Ferkel"}]
[]
[null,{"$f":"+Texte!A37","v":"Schotte"},null,{"$f":"+Texte!A38","v":"CCM"},null,{"$f":"+Texte!A34","v":"Mais ganze Pflanze"},null,{"$f":"+Texte!A35 & \" \n\" & +Texte!A36","v":"Wiesenfutter \n(Gras, Silo, ...)"}]
[null,{"$f":"+'B2'!B7","v":"TS in %"},{"v":6,"d":"6.0"},{"$f":"+B10","v":"TS in %"},61,{"$f":"+B10","v":"TS in %"},100,{"$f":"+B10","v":"TS in %"},100]
[null,{"$f":"+Texte!A17","v":"pro kg TS"},null,{"$f":"+B11","v":"pro kg TS"},null,{"$f":"+D11","v":"pro kg TS"},null,{"$f":"+F11","v":"pro kg TS"}]
[null,{"$f":"Texte!A27","v":"MJ VES/UEG"},14.6,{"$f":"Texte!A27","v":"MJ VES/UEG"},15.7,{"$f":"Texte!A27","v":"MJ VES/UEG"},10.7,{"$f":"Texte!A27","v":"MJ VES/UEG"},7.6]
[null,{"$f":"'B1'!B10","v":"g RP"},129,{"$f":"'B1'!B10","v":"g RP"},95,{"$f":"'B1'!B10","v":"g RP"},75,{"$f":"'B1'!B10","v":"g RP"},155]
[null,{"$f":"'B1'!B11","v":"g P"},7.3,{"$f":"'B1'!B11","v":"g P"},3.3,{"$f":"'B1'!B11","v":"g P"},1.9,{"$f":"'B1'!B11","v":"g P"},3.5]
[null,{"$f":"+'B2'!B12","v":"Datum"},{"$f":"+Texte!A16","v":"kg FS"},{"$f":"+B15","v":"Datum"},"kg FS","Datum",{"$f":"+Texte!A19","v":"kg TS"},"Datum","kg TS"]
[null,{"$f":"+'B4'!B16","v":"Anfang"},null,{"$f":"+B16","v":"Anfang"},null,{"$f":"+D16","v":"Anfang"},null,{"$f":"+F16","v":"Anfang"}]
{"$rows_empty":40}
[null,{"$f":"+'B4'!B57","v":"Ende"},null,{"$f":"+B57","v":"Ende"},null,{"$f":"+D57","v":"Ende"},null,{"$f":"+F57","v":"Ende"}]
[null,{"$f":"+Texte!A14","v":"In kg FS"},{"$f":"IF(SUM(C5:C7)<>100%,0,SUM(C16:C56)-C57)","v":0},{"$f":"+B58","v":"In kg FS"},{"$f":"IF(SUM(E5:E7)<>100%,0,SUM(E16:E56)-E57)","v":0},null,null,{"$f":"+F58","v":0}]
[null,{"$f":"+Texte!A15","v":"In kg TS"},{"$f":"IF(C10<>\"\",C58*C10/100,0)","v":0},{"$f":"+B59","v":"In kg TS"},{"$f":"IF(E10<>\"\",E58*E10/100,0)","v":0},{"$f":"+D59","v":"In kg TS"},{"$f":"SUM(G16:G56)-G57","v":0},{"$f":"+F59","v":"In kg TS"},{"$f":"SUM(I16:I56)-I57","v":0}]
[]
[null,{"$f":"+'B1'!B60","v":"Es müssen alle eingesetzten Futtermittel erfasst werden."}]
[]
[null,{"$f":"+'B2'!B62","v":"Kantonale Kontrollstelle, Datum:"},{"$nulls":3},{"$f":"+'B2'!F62","v":"Unterschrift:"}]
[]
[null,{"$f":"+'B2'!B64","v":"Betriebsleiter, Datum:"},{"$nulls":3},{"$f":"+F63","v":"Unterschrift:"}]
{"$rows_empty":7}
[null,4,null,2,null,3,null,4]

{"sheet":"B6","index":8,"n_rows":73,"n_cols":9,"rows_kept":73,"merged":[[8,1,8,2],[8,3,8,4]]}
[{"$nulls":3},{"$f":"Linear!D1","v":"Suisse-Bilanz: Lineare Korrektur"},{"$nulls":4},{"$f":"\"B6: \"&Texte!A4","v":"B6: Futterzufuhr"}]
[null,{"$f":"Linear!B3 & IF(Linear!C3=0,\"\",Linear!C3)","v":"Betriebs-Nr:    "},{"$nulls":3},{"$f":"Linear!B4 &IF(Linear!C4=0,\"\",Linear!C5 & \" \" &Linear!C4)","v":"Name:    "}]
[null,{"$f":"IF(SUM(C5:C8)=0%,0,IF(SUM(C5:C8)<>100%,Texte!$A$33,\"\"))","v":0},null,{"$f":"IF(SUM(E5:E7)=0%,0,IF(SUM(E5:E7)<>100%,Texte!$A$33,\"\"))","v":0}]
[null,{"$f":"+'B4'!H4","v":"Aufteilung in %"},null,{"$f":"+B4","v":"Aufteilung in %"},null,{"$f":"+Texte!A24","v":"In kg TS erfassen"},null,{"$f":"+F4","v":"In kg TS erfassen"}]
[null,{"$f":"+Texte!A20","v":"Mastschweine"},null,{"$f":"+B5","v":"Mastschweine"}]
[null,{"$f":"+Texte!A21","v":"Zuchtschw./ Eber"},null,{"$f":"+B6","v":"Zuchtschw./ Eber"},null,{"$f":"+D6","v":"Zuchtschw./ Eber"},{"v":1,"d":"100%"},{"$f":"+F6","v":"Zuchtschw./ Eber"},{"v":1,"d":"100%"}]
[null,{"$f":"+Texte!A22","v":"Ferkel"},null,{"$f":"+B7","v":"Ferkel"}]
[null,{"$f":"+Texte!A23","v":"Legehennen"}]
[null,{"$f":"+Texte!A39","v":"Stroh, Strohpellets"},null,{"$f":"+Texte!A40","v":"Beschäftigungs-, Raufutterwürfel"}]
[null,{"$f":"+'B2'!B7","v":"TS in %"},88,{"$f":"+B10","v":"TS in %"},87,{"$f":"+B10","v":"TS in %"},null,{"$f":"+B10","v":"TS in %"}]
[null,{"$f":"+Texte!A17","v":"pro kg TS"},null,{"$f":"+B11","v":"pro kg TS"},null,{"$f":"+D11","v":"pro kg TS"},null,{"$f":"+F11","v":"pro kg TS"}]
[null,{"$f":"Texte!A27","v":"MJ VES/UEG"},2.2,{"$f":"Texte!A27","v":"MJ VES/UEG"},2.1,{"$f":"Texte!A27","v":"MJ VES/UEG"},null,{"$f":"Texte!A27","v":"MJ VES/UEG"}]
[null,{"$f":"'B1'!B10","v":"g RP"},35,{"$f":"'B1'!B10","v":"g RP"},25,{"$f":"'B1'!B10","v":"g RP"},null,{"$f":"'B1'!B10","v":"g RP"}]
[null,{"$f":"'B1'!B11","v":"g P"},0.9,{"$f":"'B1'!B11","v":"g P"},1.6,{"$f":"'B1'!B11","v":"g P"},null,{"$f":"'B1'!B11","v":"g P"}]
[null,{"$f":"+'B2'!B12","v":"Datum"},{"$f":"+Texte!A16","v":"kg FS"},{"$f":"+B15","v":"Datum"},{"$f":"+C15","v":"kg FS"},{"$f":"+D15","v":"Datum"},{"$f":"+Texte!A19","v":"kg TS"},{"$f":"+F15","v":"Datum"},{"$f":"+G15","v":"kg TS"}]
[null,{"$f":"+'B4'!B16","v":"Anfang"},null,{"$f":"+B16","v":"Anfang"},null,{"$f":"+D16","v":"Anfang"},null,{"$f":"+F16","v":"Anfang"}]
{"$rows_empty":40}
[null,{"$f":"+'B4'!B57","v":"Ende"},null,{"$f":"+B57","v":"Ende"},null,{"$f":"+D57","v":"Ende"},null,{"$f":"+F57","v":"Ende"}]
[null,{"$f":"+Texte!A14","v":"In kg FS"},{"$f":"IF(SUM(C5:C8)<>100%,0,SUM(C16:C56)-C57)","v":0},{"$f":"+B58","v":"In kg FS"},{"$f":"IF(SUM(E5:E7)<>100%,0,SUM(E16:E56)-E57)","v":0},null,null,{"$f":"+F58","v":0}]
[null,{"$f":"+Texte!A15","v":"In kg TS"},{"$f":"IF(C10<>\"\",C58*C10/100,0)","v":0},{"$f":"+B59","v":"In kg TS"},{"$f":"IF(E10<>\"\",E58*E10/100,0)","v":0},{"$f":"+D59","v":"In kg TS"},{"$f":"SUM(G16:G56)-G57","v":0},{"$f":"+F59","v":"In kg TS"},{"$f":"SUM(I16:I56)-I57","v":0}]
[]
[null,{"$f":"+'B1'!B60","v":"Es müssen alle eingesetzten Futtermittel erfasst werden."}]
[]
[null,{"$f":"+'B2'!B62","v":"Kantonale Kontrollstelle, Datum:"},{"$nulls":3},{"$f":"+'B2'!F62","v":"Unterschrift:"}]
[]
[null,{"$f":"+'B2'!B64","v":"Betriebsleiter, Datum:"},{"$nulls":3},{"$f":"+F63","v":"Unterschrift:"}]
{"$rows_empty":7}
[null,4,null,2,null,3,null,4]

{"sheet":"Reserve","index":9,"n_rows":1,"n_cols":1,"rows_kept":1}
["Reserve"]